Gentoo Rhythmbox Fehler

Code (Text)
  1. make[2]: Entering directory `/var/tmp/portage/media-sound/rhythmbox-0.12.8-r1/work/rhythmbox-0.12.8/bindings'
  2. Making all in python
  3. make[3]: Entering directory `/var/tmp/portage/media-sound/rhythmbox-0.12.8-r1/work/rhythmbox-0.12.8/bindings/python'
  4. ( cd . && /usr/bin/python /usr/lib/python2.6/site-packages/gtk-2.0/codegen/codegen.py \
  5. --register /usr/share/pygtk/2.0/defs/gtk-types.defs \
  6. --register /usr/share/gst-python/0.10/defs/gst-types.defs \
  7. --override rhythmdb.override \
  8. --prefix pyrhythmdb rhythmdb.defs ) > rhythmdb.c
  9. ( cd . && /usr/bin/python /usr/lib/python2.6/site-packages/gtk-2.0/codegen/codegen.py \
  10. --register /usr/share/pygtk/2.0/defs/gtk-types.defs \
  11. --register /usr/share/pygtk/2.0/defs/gdk-base-types.defs \
  12. --register /usr/share/gst-python/0.10/defs/gst-types.defs \
  13. --register rhythmdb.defs \
  14. --override rb.override \
  15. --prefix pyrb rb.defs ) > rb.c
  16. File "/usr/lib/python2.6/site-packages/gtk-2.0/codegen/codegen.py", line 429
  17. except argtypes.ArgTypeError, ex:
  18. ^
  19. SyntaxError: invalid syntax
  20. make[3]: *** [rb.c] Fehler 1
  21. make[3]: *** Warte auf noch nicht beendete Prozesse...
  22. File "/usr/lib/python2.6/site-packages/gtk-2.0/codegen/codegen.py", line 429
  23. except argtypes.ArgTypeError, ex:
  24. ^
  25. SyntaxError: invalid syntax
  26. make[3]: *** [rhythmdb.c] Fehler 1
  27. make[3]: Leaving directory `/var/tmp/portage/media-sound/rhythmbox-0.12.8-r1/work/rhythmbox-0.12.8/bindings/python'
  28. make[2]: *** [all-recursive] Fehler 1
  29. make[2]: Leaving directory `/var/tmp/portage/media-sound/rhythmbox-0.12.8-r1/work/rhythmbox-0.12.8/bindings'
  30. make[1]: *** [all-recursive] Fehler 1
  31. make[1]: Leaving directory `/var/tmp/portage/media-sound/rhythmbox-0.12.8-r1/work/rhythmbox-0.12.8'
  32. make: *** [all] Fehler 2
  33. emake failed
  34. * ERROR: media-sound/rhythmbox-0.12.8-r1 failed (compile phase):
  35. * compile failure
  36. *
  37. * Call stack:
  38. * ebuild.sh, line 56: Called src_compile
  39. * environment, line 5595: Called gnome2_src_compile
  40. * environment, line 3108: Called die
  41. * The specific snippet of code:
  42. * emake || die "compile failure"
  43. *
  44. * If you need support, post the output of 'emerge --info =media-sound/rhythmbox-0.12.8-r1',
  45. * the complete build log and the output of 'emerge -pqv =media-sound/rhythmbox-0.12.8-r1'.
  46. * The complete build log is located at '/var/tmp/portage/media-sound/rhythmbox-0.12.8-r1/temp/build.log'.
  47. * The ebuild environment file is located at '/var/tmp/portage/media-sound/rhythmbox-0.12.8-r1/temp/environment'.
  48. * S: '/var/tmp/portage/media-sound/rhythmbox-0.12.8-r1/work/rhythmbox-0.12.8'
  49.  
make[2]: Entering directory `/var/tmp/portage/media-sound/rhythmbox-0.12.8-r1/work/rhythmbox-0.12.8/bindings'
Making all in python
make[3]: Entering directory `/var/tmp/portage/media-sound/rhythmbox-0.12.8-r1/work/rhythmbox-0.12.8/bindings/python'
( cd . && /usr/bin/python /usr/lib/python2.6/site-packages/gtk-2.0/codegen/codegen.py \
		--register /usr/share/pygtk/2.0/defs/gtk-types.defs \
		--register /usr/share/gst-python/0.10/defs/gst-types.defs \
		--override rhythmdb.override \
		--prefix pyrhythmdb rhythmdb.defs ) > rhythmdb.c 
( cd . && /usr/bin/python /usr/lib/python2.6/site-packages/gtk-2.0/codegen/codegen.py \
		--register /usr/share/pygtk/2.0/defs/gtk-types.defs \
		--register /usr/share/pygtk/2.0/defs/gdk-base-types.defs \
		--register /usr/share/gst-python/0.10/defs/gst-types.defs \
		--register rhythmdb.defs \
		--override rb.override \
		--prefix pyrb rb.defs ) > rb.c 
  File "/usr/lib/python2.6/site-packages/gtk-2.0/codegen/codegen.py", line 429
    except argtypes.ArgTypeError, ex:
                                ^
SyntaxError: invalid syntax
make[3]: *** [rb.c] Fehler 1
make[3]: *** Warte auf noch nicht beendete Prozesse...
  File "/usr/lib/python2.6/site-packages/gtk-2.0/codegen/codegen.py", line 429
    except argtypes.ArgTypeError, ex:
                                ^
SyntaxError: invalid syntax
make[3]: *** [rhythmdb.c] Fehler 1
make[3]: Leaving directory `/var/tmp/portage/media-sound/rhythmbox-0.12.8-r1/work/rhythmbox-0.12.8/bindings/python'
make[2]: *** [all-recursive] Fehler 1
make[2]: Leaving directory `/var/tmp/portage/media-sound/rhythmbox-0.12.8-r1/work/rhythmbox-0.12.8/bindings'
make[1]: *** [all-recursive] Fehler 1
make[1]: Leaving directory `/var/tmp/portage/media-sound/rhythmbox-0.12.8-r1/work/rhythmbox-0.12.8'
make: *** [all] Fehler 2
emake failed
 * ERROR: media-sound/rhythmbox-0.12.8-r1 failed (compile phase):
 *   compile failure
 * 
 * Call stack:
 *     ebuild.sh, line   56:  Called src_compile
 *   environment, line 5595:  Called gnome2_src_compile
 *   environment, line 3108:  Called die
 * The specific snippet of code:
 *       emake || die "compile failure"
 * 
 * If you need support, post the output of 'emerge --info =media-sound/rhythmbox-0.12.8-r1',
 * the complete build log and the output of 'emerge -pqv =media-sound/rhythmbox-0.12.8-r1'.
 * The complete build log is located at '/var/tmp/portage/media-sound/rhythmbox-0.12.8-r1/temp/build.log'.
 * The ebuild environment file is located at '/var/tmp/portage/media-sound/rhythmbox-0.12.8-r1/temp/environment'.
 * S: '/var/tmp/portage/media-sound/rhythmbox-0.12.8-r1/work/rhythmbox-0.12.8'

Angelegt am: 06.04.2011 15:24

Zeilen hervorheben


Links



Löschen